Target
Estrogen receptor
Ligand
BDBM18525
Substrate
Meas. Tech.
ChEMBL_775981 (CHEMBL1912979)
IC50
>1000000±n/a nM
Citation
 Nagata, NMiyakawa, MAmano, SFuruya, KYamamoto, NNejishima, HInoguchi, K Tetrahydroquinolines as a novel series of nonsteroidal selective androgen receptor modulators: structural requirements for better physicochemical and biological properties. Bioorg Med Chem Lett 21:6310-3 (2011)  
Target
Name:
Estrogen receptor
Synonyms:
ESR1_RAT Esr1 Nr3a1 | estrogen alpha
Type:
Enzyme Catalytic Domain
Mol. Mass.:
67045.89
Organism:
RAT
Description:
estrogen alpha 0 RAT::P06211
Residue:
600
  
Inhibitor
Name:
BDBM18525
Synonyms:
Bicalutamide N-[4-cyano-3-(trifluoromethyl)phenyl]-3-[(4-fluorobenzene)sulfonyl]-2-hydroxy-2-methylpropanamide US20230382870, Bicalutumide US9682960, CAS
Type:
Small organic molecule
Emp. Form.:
C18H14F4N2O4S
Mol. Mass.:
430.373
SMILES:
CC(O)(CS(=O)(=O)c1ccc(F)cc1)C(=O)Nc1ccc(C#N)c(c1)C(F)(F)F
: