Target
Nitric oxide synthase, inducible
Ligand
BDBM50356489
Substrate
Meas. Tech.
ChEMBL_775891 (CHEMBL1912864)
EC50
42±n/a nM
Citation
 Gahman, TCHerbert, MRLang, HThayer, ASymons, KTNguyen, PMMassari, MEDozier, SZhang, YSablad, MRao, TSNoble, SAShiau, AKHassig, CA Identification and SAR of selective inducible nitric oxide synthase (iNOS) dimerization inhibitors. Bioorg Med Chem Lett 21:6888-94 (2011)  
Target
Name:
Nitric oxide synthase, inducible
Synonyms:
HEP-NOS Inducible NO synthase NOS type II NOS2A Nitric oxide synthase, inducible (iNOS) | iNOS
Type:
Homodimer
Mol. Mass.:
131141.95
Organism:
Homo sapiens (Human)
Description:
P35228
Residue:
1153
  
Inhibitor
Name:
BDBM50356489
Synonyms:
CHEMBL1912003
Type:
Small organic molecule
Emp. Form.:
C23H24N6O3S
Mol. Mass.:
464.54
SMILES:
Oc1ccc(CN(CCCNCc2ccc3OCOc3c2)c2nc(ns2)-n2ccnc2)cc1
: