Target
Cannabinoid receptor 1
Ligand
BDBM50356539
Substrate
Meas. Tech.
ChEMBL_776030 (CHEMBL1912500)
Ki
45.9±n/a nM
Citation
 Piscitelli, FLigresti, ALa Regina, GGatti, VBrizzi, APasquini, SAllarà, MCarai, MANovellino, EColombo, GDi Marzo, VCorelli, FSilvestri, R 1-Aryl-5-(1H-pyrrol-1-yl)-1H-pyrazole-3-carboxamide: an effective scaffold for the design of either CB1 or CB2 receptor ligands. Eur J Med Chem 46:5641-53 (2011)  
Target
Name:
Cannabinoid receptor 1
Synonyms:
CANN6 CB-R CNR CNR1_HUMAN Cannabinoid receptor Cannabinoid receptor 1 (brain)
Type:
G Protein-Coupled Receptor (GPCR)
Mol. Mass.:
52868.96
Organism:
Homo sapiens (Human)
Description:
P21554
Residue:
472
  
Inhibitor
Name:
BDBM50356539
Synonyms:
CHEMBL1909847
Type:
Small organic molecule
Emp. Form.:
C26H22Cl4N4O
Mol. Mass.:
548.291
SMILES:
Cc1c(nn(c1-n1cc2CCCCc2c1)-c1ccc(Cl)cc1Cl)C(=O)NCc1ccc(Cl)c(Cl)c1
: