Target
Cannabinoid receptor 2
Ligand
BDBM50356549
Substrate
Meas. Tech.
ChEMBL_776031 (CHEMBL1912501)
Ki
161.7±n/a nM
Citation
 Piscitelli, FLigresti, ALa Regina, GGatti, VBrizzi, APasquini, SAllarà, MCarai, MANovellino, EColombo, GDi Marzo, VCorelli, FSilvestri, R 1-Aryl-5-(1H-pyrrol-1-yl)-1H-pyrazole-3-carboxamide: an effective scaffold for the design of either CB1 or CB2 receptor ligands. Eur J Med Chem 46:5641-53 (2011)  
Target
Name:
Cannabinoid receptor 2
Synonyms:
CANNABINOID CB2 CB2 CB2B CNR2_HUMAN Cannabinoid CB2 receptor Cannabinoid receptor 2 (CB2R) | hCB2
Type:
G Protein-Coupled Receptor (GPCR)
Mol. Mass.:
39690.94
Organism:
Homo sapiens (Human)
Description:
P34972
Residue:
360
  
Inhibitor
Name:
BDBM50356549
Synonyms:
CHEMBL1909857
Type:
Small organic molecule
Emp. Form.:
C22H14Cl6N4O
Mol. Mass.:
563.091
SMILES:
Cc1c(nn(c1-n1c(Cl)ccc1Cl)-c1ccc(Cl)c(Cl)c1)C(=O)NCc1ccc(Cl)c(Cl)c1
: