Target
Histamine H4 receptor
Ligand
BDBM50315314
Substrate
Meas. Tech.
ChEMBL_786095 (CHEMBL1919838)
Ki
4.7±n/a nM
Citation
 Savall, BMGomez, LChavez, FCurtis, MMeduna, SPKearney, ADunford, PCowden, JThurmond, RLGrice, CEdwards, JP Tricyclic aminopyrimidine histamine H4 receptor antagonists. Bioorg Med Chem Lett 21:6577-81 (2011)  
Target
Name:
Histamine H4 receptor
Synonyms:
AXOR35 GPCR105 HH4R HRH4 Histamine H4 receptor Histamine receptor (H3 and H4) SP9144
Type:
G Protein-Coupled Receptor (GPCR)
Mol. Mass.:
44517.02
Organism:
Homo sapiens (Human)
Description:
Binding assays were using CHO cells stably expressing hH4R receptors.
Residue:
390
  
Inhibitor
Name:
BDBM50315314
Synonyms:
8-chloro-4-(4-methylpiperazin-1-yl)benzofuro[3,2-d]pyrimidine | CHEMBL1093180
Type:
Small organic molecule
Emp. Form.:
C15H15ClN4O
Mol. Mass.:
302.759
SMILES:
CN1CCN(CC1)c1ncnc2c3cc(Cl)ccc3oc12
: