Target
Matrix metalloproteinase-9
Ligand
BDBM50356960
Substrate
Meas. Tech.
ChEMBL_787971 (CHEMBL1918905)
IC50
0.210000±n/a nM
Citation
 Wilson, LJWang, BYang, SMScannevin, RHBurke, SLKarnachi, PRhodes, KJMurray, WV Discovery of novel Cobactin-T based matrix metalloproteinase inhibitors via a ring closing metathesis strategy. Bioorg Med Chem Lett 21:6485-90 (2011)  
Target
Name:
Matrix metalloproteinase-9
Synonyms:
67 kDa matrix metalloproteinase-9 92 kDa gelatinase CLG4B Gelatinase B MMP9 Matrix metalloproteinase 9 (MMP-9) Matrix metalloproteinase-9 (MMP9)
Type:
Enzyme
Mol. Mass.:
78452.28
Organism:
Homo sapiens (Human)
Description:
P14780
Residue:
707
  
Inhibitor
Name:
BDBM50356960
Synonyms:
CHEMBL1916211
Type:
Small organic molecule
Emp. Form.:
C25H30ClN3O5S
Mol. Mass.:
520.041
SMILES:
ON1CC=CC[C@@H](N(CCN2CCCCC2)S(=O)(=O)c2ccc(Oc3ccc(Cl)cc3)cc2)C1=O
: