Target
Muscarinic acetylcholine receptor M3
Ligand
BDBM43822
Substrate
Meas. Tech.
ChEMBL_788149 (CHEMBL1919230)
EC50
>30000±n/a nM
Citation
 Lebois, EPDigby, GJSheffler, DJMelancon, BJTarr, JCCho, HPMiller, NRMorrison, RBridges, TMXiang, ZScott Daniels, JWood, MRConn, PJLindsley, CW Development of a highly selective, orally bioavailable and CNS penetrant M1 agonist derived from the MLPCN probe ML071. Bioorg Med Chem Lett 21:6451-5 (2011)  
Target
Name:
Muscarinic acetylcholine receptor M3
Synonyms:
ACM3_RAT Chrm-3 | Chrm3
Type:
Enzyme Catalytic Domain
Mol. Mass.:
66086.66
Organism:
RAT
Description:
Cholinergic, muscarinic M3 CHRM3 RAT::P08483
Residue:
589
  
Inhibitor
Name:
BDBM43822
Synonyms:
4-[2-(o-toluoylamino)ethylamino]piperidine-1-carboxylic acid ethyl ester;hydrochloride CHEMBL1624037 cid_25010775 ethyl 4-[2-[(2-methylphenyl)carbonylamino]ethylamino]piperidine-1-carboxylate;hydrochloride
Type:
Small organic molecule
Emp. Form.:
C18H27N3O3
Mol. Mass.:
333.4253
SMILES:
CCOC(=O)N1CCC(CC1)NCCNC(=O)c1ccccc1C
: