Target
Muscarinic acetylcholine receptor M2
Ligand
BDBM50356974
Substrate
Meas. Tech.
ChEMBL_788047 (CHEMBL1919026)
EC50
>10000±n/a nM
Citation
 Lebois, EPDigby, GJSheffler, DJMelancon, BJTarr, JCCho, HPMiller, NRMorrison, RBridges, TMXiang, ZScott Daniels, JWood, MRConn, PJLindsley, CW Development of a highly selective, orally bioavailable and CNS penetrant M1 agonist derived from the MLPCN probe ML071. Bioorg Med Chem Lett 21:6451-5 (2011)  
Target
Name:
Muscarinic acetylcholine receptor M2
Synonyms:
ACM2_RAT Chrm-2 | Chrm2
Type:
Enzyme Catalytic Domain
Mol. Mass.:
51555.53
Organism:
RAT
Description:
P10980
Residue:
466
  
Inhibitor
Name:
BDBM50356974
Synonyms:
CHEMBL1916229
Type:
Small organic molecule
Emp. Form.:
C20H27F2N3O3
Mol. Mass.:
395.4435
SMILES:
CCOC(=O)N1CCC(CC1)N1CCC[C@H](C1)NC(=O)c1ccc(F)c(F)c1
: