Target
Collagenase 3
Ligand
BDBM50357026
Substrate
Meas. Tech.
ChEMBL_788431 (CHEMBL1918196)
IC50
2.2±n/a nM
Citation
 Tommasi, RAWeiler, SMcQuire, LWRogel, OChambers, MClark, KDoughty, JFang, JGanu, VGrob, JGoldberg, RGoldstein, RLavoie, SKulathila, RMacchia, WMelton, RSpringer, CWalker, MZhang, JZhu, LShultz, M Potent and selective 2-naphthylsulfonamide substituted hydroxamic acid inhibitors of matrix metalloproteinase-13. Bioorg Med Chem Lett 21:6440-5 (2011)  
Target
Name:
Collagenase 3
Synonyms:
MMP-13 MMP13_HUMAN Matrix metalloproteinase-13 (MMP-13) | Matrix metalloproteinase-13 (MMP13)
Type:
Enzyme
Mol. Mass.:
53808.06
Organism:
Homo sapiens (Human)
Description:
P45452
Residue:
471
  
Inhibitor
Name:
BDBM50357026
Synonyms:
CHEMBL1916650
Type:
Small organic molecule
Emp. Form.:
C21H23N3O4S
Mol. Mass.:
413.49
SMILES:
CC(C)[C@@H](N(Cc1ccccn1)S(=O)(=O)c1ccc2ccccc2c1)C(=O)NO
: