Target
Collagenase 3
Ligand
BDBM8465
Substrate
Meas. Tech.
ChEMBL_788431 (CHEMBL1918196)
IC50
1.2±n/a nM
Citation
 Tommasi, RAWeiler, SMcQuire, LWRogel, OChambers, MClark, KDoughty, JFang, JGanu, VGrob, JGoldberg, RGoldstein, RLavoie, SKulathila, RMacchia, WMelton, RSpringer, CWalker, MZhang, JZhu, LShultz, M Potent and selective 2-naphthylsulfonamide substituted hydroxamic acid inhibitors of matrix metalloproteinase-13. Bioorg Med Chem Lett 21:6440-5 (2011)  
Target
Name:
Collagenase 3
Synonyms:
MMP-13 MMP13_HUMAN Matrix metalloproteinase-13 (MMP-13) | Matrix metalloproteinase-13 (MMP13)
Type:
Enzyme
Mol. Mass.:
53808.06
Organism:
Homo sapiens (Human)
Description:
P45452
Residue:
471
  
Inhibitor
Name:
BDBM8465
Synonyms:
(2R)-N-hydroxy-2-[(4-methoxybenzene)(pyridin-3-ylmethyl)sulfonamido]-3-methylbutanamide CGS 27023 CHEMBL514138 | hydroxamate analogue 1
Type:
Small organic molecule
Emp. Form.:
C18H23N3O5S
Mol. Mass.:
393.457
SMILES:
COc1ccc(cc1)S(=O)(=O)N(Cc1cccnc1)[C@H](C(C)C)C(=O)NO
: