Target
Substance-P receptor
Ligand
BDBM50357171
Substrate
Meas. Tech.
ChEMBL_787726 (CHEMBL1918309)
IC50
>100±n/a nM
Citation
 Shirai, JYoshikawa, TYamashita, MYamamoto, YKawamoto, MTarui, NKamo, IHashimoto, TIkeura, Y Design, structure-activity relationship, and highly efficient asymmetric synthesis of 3-phenyl-4-benzylaminopiperidine derivatives as novel neurokinin-1 receptor antagonists. Bioorg Med Chem 19:6430-46 (2011)  
Target
Name:
Substance-P receptor
Synonyms:
NK-1 receptor NK1 Receptor NK1R_HUMAN Neurokinin-1 (NK-1) SPR TACR1 Tachykinin receptor 1 (NK1) | tachykinin
Type:
G Protein-Coupled Receptor (GPCR)
Mol. Mass.:
46254.43
Organism:
Homo sapiens (Human)
Description:
P25103
Residue:
407
  
Inhibitor
Name:
BDBM50357171
Synonyms:
CHEMBL1917868
Type:
Small organic molecule
Emp. Form.:
C25H28F3N7O3
Mol. Mass.:
531.5301
SMILES:
COc1ccc(cc1CN[C@@H]1CCN(C[C@@H]1c1ccccc1)C(=O)CNC(C)=O)-n1nnnc1C(F)(F)F
: