Target
Sigma non-opioid intracellular receptor 1
Ligand
BDBM50357453
Substrate
Meas. Tech.
ChEMBL_788478 (CHEMBL1918281)
Ki
0.7±n/a nM
Citation
 Rossi, DPedrali, AUrbano, MGaggeri, RSerra, MFernández, LFernández, MCaballero, JRonsisvalle, SPrezzavento, OSchepmann, DWuensch, BPeviani, MCurti, DAzzolina, OCollina, S Identification of a potent and selectives¿? receptor agonist potentiating NGF-induced neurite outgrowth in PC12 cells. Bioorg Med Chem 19:6210-24 (2011)  
Target
Name:
Sigma non-opioid intracellular receptor 1
Synonyms:
OPRS1 SIGMAR1 Sigma non-opioid intracellular receptor 1 Sigma1-receptor Sterol isomerase-like protein
Type:
Protein
Mol. Mass.:
25307.17
Organism:
Cavia porcellus (Guinea pig)
Description:
Q60492
Residue:
223
  
Inhibitor
Name:
BDBM50357453
Synonyms:
CHEMBL1917719
Type:
Small organic molecule
Emp. Form.:
C21H27N
Mol. Mass.:
293.4458
SMILES:
CC(CCN1CCCCC1)c1ccc(cc1)-c1ccccc1
: