Target
Protein kinase C epsilon type
Ligand
BDBM50357492
Substrate
Meas. Tech.
ChEMBL_787526 (CHEMBL1919487)
EC50
16090±n/a nM
Citation
 Das, JPany, SPanchal, SMajhi, ARahman, GM Binding of isoxazole and pyrazole derivatives of curcumin with the activator binding domain of novel protein kinase C. Bioorg Med Chem 19:6196-202 (2011)  
Target
Name:
Protein kinase C epsilon type
Synonyms:
KPCE_HUMAN PKCE Protein kinase C epsilon Protein kinase C, PKC; classical/novel nPKC-epsilon
Type:
Enzyme
Mol. Mass.:
83680.45
Organism:
Homo sapiens (Human)
Description:
The recombinant human PKC enzymes were produced using a baculovirus expression system in SF9 cells
Residue:
737
  
Inhibitor
Name:
BDBM50357492
Synonyms:
CHEMBL1914609
Type:
Small organic molecule
Emp. Form.:
C25H28N2O4
Mol. Mass.:
420.5008
SMILES:
CCCCOc1ccc(C=Cc2cc(C=Cc3ccc(O)c(OC)c3)n[nH]2)cc1OC
: