Target
Serine/threonine-protein kinase pim-1
Ligand
BDBM50357602
Substrate
Meas. Tech.
ChEMBL_788036 (CHEMBL1919015)
IC50
2±n/a nM
Citation
 Pierre, FStefan, ENédellec, ASChevrel, MCRegan, CFSiddiqui-Jain, AMacalino, DStreiner, NDrygin, DHaddach, MO'Brien, SEAnderes, KRyckman, DM 7-(4H-1,2,4-Triazol-3-yl)benzo[c][2,6]naphthyridines: a novel class of Pim kinase inhibitors with potent cell antiproliferative activity. Bioorg Med Chem Lett 21:6687-92 (2011)  
Target
Name:
Serine/threonine-protein kinase pim-1
Synonyms:
PIM-1 Kinase PIM1_HUMAN Serine/threonine-protein kinase (PIM1) Serine/threonine-protein kinase PIM1 | Serine/threonine-protein kinase pim-1 (PIM1)
Type:
Protein
Mol. Mass.:
35681.82
Organism:
Homo sapiens (Human)
Description:
P11309
Residue:
313
  
Inhibitor
Name:
BDBM50357602
Synonyms:
CHEMBL1915636
Type:
Small organic molecule
Emp. Form.:
C20H12F2N6
Mol. Mass.:
374.3463
SMILES:
Fc1cccc(F)c1Nc1nc2c(cccc2c2cnccc12)-c1nnc[nH]1
: