Target
Serine/threonine-protein kinase pim-2
Ligand
BDBM50357611
Substrate
Meas. Tech.
ChEMBL_788035 (CHEMBL1919014)
IC50
5±n/a nM
Citation
 Pierre, FStefan, ENédellec, ASChevrel, MCRegan, CFSiddiqui-Jain, AMacalino, DStreiner, NDrygin, DHaddach, MO'Brien, SEAnderes, KRyckman, DM 7-(4H-1,2,4-Triazol-3-yl)benzo[c][2,6]naphthyridines: a novel class of Pim kinase inhibitors with potent cell antiproliferative activity. Bioorg Med Chem Lett 21:6687-92 (2011)  
Target
Name:
Serine/threonine-protein kinase pim-2
Synonyms:
PIM2 Pim-2h Serine/threonine-protein kinase PIM | Serine/threonine-protein kinase pim-2 (PIM2)
Type:
Serine/threonine-protein kinase
Mol. Mass.:
34185.93
Organism:
Homo sapiens (Human)
Description:
Q9P1W9
Residue:
311
  
Inhibitor
Name:
BDBM50357611
Synonyms:
CHEMBL1915645
Type:
Small organic molecule
Emp. Form.:
C21H17ClN4O2
Mol. Mass.:
392.838
SMILES:
CNC(=O)c1cccc2c1nc(Nc1cccc(OC)c1Cl)c1ccncc21
: