Target
Bcl-2-like protein 2
Ligand
BDBM50357752
Substrate
Meas. Tech.
ChEMBL_785938 (CHEMBL1921248)
Ki
63±n/a nM
Citation
 Goreshnik, IBrock, AMMaly, DJ Biochemical and pharmacological profiling of the pro-survival protein Bcl-xL. Bioorg Med Chem Lett 21:4951-5 (2011)  
Target
Name:
Bcl-2-like protein 2
Synonyms:
Apoptosis regulator Bcl-W BCL-W BCLW Bcl2-L-2 | KIAA0271
Type:
Protein
Mol. Mass.:
20742.61
Organism:
Homo sapiens (Human)
Description:
Residue:
193
  
Inhibitor
Name:
BDBM50357752
Synonyms:
CHEMBL1916190
Type:
Small organic molecule
Emp. Form.:
C38H43F3N6O5S2
Mol. Mass.:
784.91
SMILES:
C[C@H]1CN(CCN1Cc1ccccc1C(F)(F)F)c1ccc(cc1)C(=O)NS(=O)(=O)c1ccc(N[C@H](CCN(C)C)CSc2ccccc2)c(c1)[N+]([O-])=O
: