Target
cAMP and cAMP-inhibited cGMP 3',5'-cyclic phosphodiesterase 10A
Ligand
BDBM50357858
Substrate
Meas. Tech.
ChEMBL_787236 (CHEMBL1918958)
IC50
1.9±n/a nM
Citation
 Malamas, MSNi, YErdei, JStange, HSchindler, RLankau, HJGrunwald, CFan, KYParris, KLangen, BEgerland, UHage, TMarquis, KLGrauer, SBrennan, JNavarra, RGraf, RHarrison, BLRobichaud, AKronbach, TPangalos, MNHoefgen, NBrandon, NJ Highly potent, selective, and orally active phosphodiesterase 10A inhibitors. J Med Chem 54:7621-38 (2011)  
Target
Name:
cAMP and cAMP-inhibited cGMP 3',5'-cyclic phosphodiesterase 10A
Synonyms:
3',5'-cyclic phosphodiesterase PDE10_HUMAN Phosphodiesterase 10A
Type:
Protein
Mol. Mass.:
88412.52
Organism:
Homo sapiens (Human)
Description:
Q9Y233
Residue:
779
  
Inhibitor
Name:
BDBM50357858
Synonyms:
CHEMBL1916118
Type:
Small organic molecule
Emp. Form.:
C20H16F3N3O
Mol. Mass.:
371.3557
SMILES:
Cc1nc(-c2ccccc2C)n2c1c(C)nc1c(OC(F)F)cc(F)cc21
: