Target
D(3) dopamine receptor
Ligand
BDBM50357938
Substrate
Meas. Tech.
ChEMBL_786911 (CHEMBL1920025)
Ki
0.71±n/a nM
Citation
 Kühhorn, JGötz, AHübner, HThompson, DWhistler, JGmeiner, P Development of a bivalent dopamine D2 receptor agonist. J Med Chem 54:7911-9 (2011)  
Target
Name:
D(3) dopamine receptor
Synonyms:
DOPAMINE D3 DRD3_HUMAN Dopamine D3 receptor (D3) Dopamine receptor Dopamine receptor D3
Type:
Mol. Mass.:
44243.43
Organism:
Homo sapiens (Human)
Description:
Residue:
400
  
Inhibitor
Name:
BDBM50357938
Synonyms:
CHEMBL1916551
Type:
Small organic molecule
Emp. Form.:
C33H47N5O3
Mol. Mass.:
561.758
SMILES:
CCCCn1cc(CCCOc2ccc(cc2OC)C(=O)NCCCCN(CCC)C2Cc3ccccc3C2)nn1
: