Target
Acetylcholinesterase
Ligand
BDBM50357947
Substrate
Meas. Tech.
ChEMBL_787087 (CHEMBL1918654)
IC50
>100000±n/a nM
Citation
 Martins, CCarreiras, MCLeón, Rde los Ríos, CBartolini, MAndrisano, VIriepa, IMoraleda, IGálvez, EGarcía, MEgea, JSamadi, AChioua, MMarco-Contelles, J Synthesis and biological assessment of diversely substituted furo[2,3-b]quinolin-4-amine and pyrrolo[2,3-b]quinolin-4-amine derivatives, as novel tacrine analogues. Eur J Med Chem 46:6119-30 (2011)  
Target
Name:
Acetylcholinesterase
Synonyms:
ACES_HUMAN Acetylcholinesterase (AChE) | Acetylcholinesterase (human AChE)
Type:
Enzyme
Mol. Mass.:
67792.70
Organism:
Homo sapiens (Human)
Description:
P22303
Residue:
614
  
Inhibitor
Name:
BDBM50357947
Synonyms:
CHEMBL1916927
Type:
Small organic molecule
Emp. Form.:
C17H15ClN2O
Mol. Mass.:
298.767
SMILES:
Nc1c2CCCCc2nc2oc(cc12)-c1ccc(Cl)cc1
: