Target
Amine oxidase [flavin-containing] A
Ligand
BDBM50358012
Substrate
Meas. Tech.
ChEMBL_786455 (CHEMBL1920950)
IC50
0.83±n/a nM
Citation
 Prado-Prado, FGarcía-Mera, XEscobar, MSobarzo-Sánchez, EYañez, MRiera-Fernandez, PGonzález-Díaz, H 2D MI-DRAGON: a new predictor for protein-ligands interactions and theoretic-experimental studies of US FDA drug-target network, oxoisoaporphine inhibitors for MAO-A and human parasite proteins. Eur J Med Chem 46:5838-51 (2011)  
Target
Name:
Amine oxidase [flavin-containing] A
Synonyms:
AOFA_HUMAN MAO-A Monoamine oxidase Monoamine oxidase type A (MAO A) Monoamine oxidase type A (MAOA)
Type:
Protein
Mol. Mass.:
59689.53
Organism:
Homo sapiens (Human)
Description:
P21397
Residue:
527
  
Inhibitor
Name:
BDBM50358012
Synonyms:
CHEMBL1651055
Type:
Small organic molecule
Emp. Form.:
C17H11NO2
Mol. Mass.:
261.2747
SMILES:
COc1cc2C(=O)c3ccccc3-c3nccc(c1)c23
: