Target
Cytochrome P450 2D6
Ligand
BDBM50358174
Substrate
Meas. Tech.
ChEMBL_788862 (CHEMBL1924932)
IC50
>30000±n/a nM
Citation
 Jones, CKEngers, DWThompson, ADField, JRBlobaum, ALLindsley, SRZhou, YGogliotti, RDJadhav, SZamorano, RBogenpohl, JSmith, YMorrison, RDaniels, JSWeaver, CDConn, PJLindsley, CWNiswender, CMHopkins, CR Discovery, synthesis, and structure-activity relationship development of a series of N-4-(2,5-dioxopyrrolidin-1-yl)phenylpicolinamides (VU0400195, ML182): characterization of a novel positive allosteric modulator of the metabotropic glutamate receptor 4 (mGlu(4)) with oral efficacy in an antiparkin J Med Chem 54:7639-47 (2011)  
Target
Name:
Cytochrome P450 2D6
Synonyms:
CP2D6_HUMAN CYP2DL1 Cytochrome P450 2D6 (CYP2D6) P450-DB1
Type:
Protein
Mol. Mass.:
55774.82
Organism:
Homo sapiens (Human)
Description:
P10635
Residue:
497
  
Inhibitor
Name:
BDBM50358174
Synonyms:
CHEMBL1921855
Type:
Small organic molecule
Emp. Form.:
C18H13N3O5S2
Mol. Mass.:
415.443
SMILES:
O=C(Nc1ccc(cc1)N1S(=O)(=O)c2ccccc2S1(=O)=O)c1ccccn1
: