Target
Phosphatidylinositol 4,5-bisphosphate 3-kinase catalytic subunit gamma isoform
Ligand
BDBM50358204
Substrate
Meas. Tech.
ChEMBL_790088 (CHEMBL1925478)
IC50
36±n/a nM
Citation
 Sutherlin, DPBao, LBerry, MCastanedo, GChuckowree, IDotson, JFolks, AFriedman, LGoldsmith, RGunzner, JHeffron, TLesnick, JLewis, CMathieu, SMurray, JNonomiya, JPang, JPegg, NPrior, WWRouge, LSalphati, LSampath, DTian, QTsui, VWan, NCWang, SWei, BWiesmann, CWu, PZhu, BYOlivero, A Discovery of a potent, selective, and orally available class I phosphatidylinositol 3-kinase (PI3K)/mammalian target of rapamycin (mTOR) kinase inhibitor (GDC-0980) for the treatment of cancer. J Med Chem 54:7579-87 (2011)  
Target
Name:
Phosphatidylinositol 4,5-bisphosphate 3-kinase catalytic subunit gamma isoform
Synonyms:
PI3-kinase p110 subunit gamma PI3Kgamma PK3CG_HUMAN Phosphatidylinositol 4,5-bisphosphate 3-kinase (PI3K) Phosphatidylinositol 4,5-bisphosphate 3-kinase catalytic subunit gamma (PI3Kgamma) Phosphatidylinositol 4,5-bisphosphate 3-kinase catalytic subunit gamma isoform (PI3K) Phosphatidylinositol-4,5-bisphosphate 3-kinase catalytic subunit gamma isoform Phosphoinositide 3-kinases gamma (PI3K gamma) p120-PI3K
Type:
Enzyme Subunit
Mol. Mass.:
126470.30
Organism:
Homo sapiens (Human)
Description:
P48736
Residue:
1102
  
Inhibitor
Name:
BDBM50358204
Synonyms:
CHEMBL1922094
Type:
Small organic molecule
Emp. Form.:
C23H30N8O3S
Mol. Mass.:
498.601
SMILES:
C[C@H](O)C(=O)N1CCN(Cc2sc3c(nc(nc3c2C)-c2cnc(N)nc2)N2CCOCC2)CC1
: