Target
Diacylglycerol O-acyltransferase 1
Ligand
BDBM50358337
Substrate
Meas. Tech.
ChEMBL_789310 (CHEMBL1924477)
EC50
910±n/a nM
Citation
 Yun, WAhmad, MChen, YGillespie, PConde-Knape, KKazmer, SLi, SQian, YTaub, RWertheimer, SJWhittard, TBolin, D Discovery and optimization of 2-phenyloxazole derivatives as diacylglycerol acyltransferase-1 inhibitors. Bioorg Med Chem Lett 21:7205-9 (2011)  
Target
Name:
Diacylglycerol O-acyltransferase 1
Synonyms:
ACAT-related gene product 1 Acyl coA-diacylglycerol acyl transferase 1 (DGAT1) DGAT1 Diacylglycerol Acyltransferase (DGAT1) Diacylglycerol O-acyltransferase 1 (DGAT1) | Diglyceride acyltransferase
Type:
Protein
Mol. Mass.:
55297.82
Organism:
Homo sapiens (Human)
Description:
O75907
Residue:
488
  
Inhibitor
Name:
BDBM50358337
Synonyms:
CHEMBL1922686
Type:
Small organic molecule
Emp. Form.:
C20H19F3N4O2
Mol. Mass.:
404.3857
SMILES:
CCN(CC)c1ccc(NC(=O)c2nc(oc2C(F)(F)F)-c2ccccc2)cn1
: