Target
CAI-1 autoinducer sensor kinase/phosphatase CqsS
Ligand
BDBM50358404
Substrate
Meas. Tech.
ChEMBL_789525 (CHEMBL1924552)
EC50
21000±n/a nM
Citation
 Bolitho, MEPerez, LJKoch, MJNg, WLBassler, BLSemmelhack, MF Small molecule probes of the receptor binding site in the Vibrio cholerae CAI-1 quorum sensing circuit. Bioorg Med Chem 19:6906-18 (2011)  
Target
Name:
CAI-1 autoinducer sensor kinase/phosphatase CqsS
Synonyms:
CQSS_VIBCH cqsS
Type:
PROTEIN
Mol. Mass.:
78371.16
Organism:
Vibrio cholerae serotype O1 (strain ATCC 39315 / El Tor Inaba N16961)
Description:
ChEMBL_789528
Residue:
686
  
Inhibitor
Name:
BDBM50358404
Synonyms:
CHEMBL1922858
Type:
Small organic molecule
Emp. Form.:
C13H26O2
Mol. Mass.:
214.3443
SMILES:
CCCCCCCCCC(O)C(=O)CC
: