Target
Melanin-concentrating hormone receptor 1
Ligand
BDBM50358731
Substrate
Meas. Tech.
ChEMBL_789559 (CHEMBL1924586)
IC50
50±n/a nM
Citation
 Mihalic, JTChen, XFan, PChen, XFu, YLiang, LReed, MTang, LChen, JLJaen, JLi, LDai, K Discovery of a novel series of melanin-concentrating hormone receptor 1 antagonists for the treatment of obesity. Bioorg Med Chem Lett 21:7001-5 (2011)  
Target
Name:
Melanin-concentrating hormone receptor 1
Synonyms:
G-protein coupled receptor 24 MCH receptor 1 MCH-R1 MCHR-1 MCHR1_HUMAN Melanin-Concentrating Hormone Receptor 1 (MCH1R) Melanin-concentrating hormone receptor 1 (MCH-1) Melanin-concentrating hormone receptor 1 (MCHR-1) SLC-1 Somatostatin receptor-like protein
Type:
G Protein-Coupled Receptor (GPCR)
Mol. Mass.:
45976.27
Organism:
Homo sapiens (Human)
Description:
Membranes from CHO-K1 cells stably expressing human MCH1R were used in assays.
Residue:
422
  
Inhibitor
Name:
BDBM50358731
Synonyms:
CHEMBL1922258
Type:
Small organic molecule
Emp. Form.:
C17H20Cl2N2
Mol. Mass.:
323.26
SMILES:
CC1C2CN(C)CCC2Cc2[nH]c3cc(Cl)c(Cl)cc3c12
: