Target
Tyrosine-protein kinase JAK2
Ligand
BDBM50358904
Substrate
Meas. Tech.
ChEMBL_790799 (CHEMBL1926252)
IC50
0.36±n/a nM
Citation
 Weinberg, LRAlbom, MSAngeles, TSBreslin, HJGingrich, DEHuang, ZLisko, JGMason, JLMilkiewicz, KLThieu, TVUnderiner, TLWells, GJWells-Knecht, KJDorsey, BD 2,7-Pyrrolo[2,1-f][1,2,4]triazines as JAK2 inhibitors: modification of target structure to minimize reactive metabolite formation. Bioorg Med Chem Lett 21:7325-30 (2011)  
Target
Name:
Tyrosine-protein kinase JAK2
Synonyms:
JAK-2 JAK2_HUMAN Janus kinase 2 (JAK2) | Janus kinase 2 (a protein tyrosine kinase)
Type:
Protein
Mol. Mass.:
130684.68
Organism:
Homo sapiens (Human)
Description:
O60674
Residue:
1132
  
Inhibitor
Name:
BDBM50358904
Synonyms:
CHEMBL1923580
Type:
Small organic molecule
Emp. Form.:
C29H36FN7O3S
Mol. Mass.:
581.705
SMILES:
C[C@H](O)CN1CCN(CC1)c1ccc(Nc2ncc3ccc(-c4cccc(c4)S(=O)(=O)NC(C)(C)C)n3n2)cc1F
: