Target
Casein kinase II subunit alpha
Ligand
BDBM13533
Substrate
Meas. Tech.
ChEMBL_793859 (CHEMBL1932832)
IC50
>30000±n/a nM
Citation
 Moffett, KKonteatis, ZNguyen, DShetty, RLudington, JFujimoto, TLee, KJChai, XNamboodiri, HKarpusas, MDorsey, BGuarnieri, FBukhtiyarova, MSpringman, EMichelotti, E Discovery of a novel class of non-ATP site DFG-out state p38 inhibitors utilizing computationally assisted virtual fragment-based drug design (vFBDD). Bioorg Med Chem Lett 21:7155-65 (2011)  
Target
Name:
Casein kinase II subunit alpha
Synonyms:
CK II CK2- alpha CSK21_HUMAN Casein kinase 2 Casein kinase II alpha/beta Casein kinase II subunit alpha (CK2A1) Casein kinase II subunit alpha (CK2a V66A) Casein kinase II subunit alpha (CK2a)
Type:
Enzyme
Mol. Mass.:
45151.12
Organism:
Homo sapiens (Human)
Description:
P68400
Residue:
391
  
Inhibitor
Name:
BDBM13533
Synonyms:
1-[2-(4-methylphenyl)-5-tert-butyl-pyrazol-3-yl]-3-[4-(2-morpholin-4-ylethoxy)naphthalen-1-yl]urea 1-[5-tert-butyl-2-(4-methylphenyl)pyrazol-3-yl]-3-[4-(2-morpholin-4-ylethoxy)naphthalen-1-yl]urea 3-[2-(4-methylphenyl)-5-tert-butyl-pyrazol-3-yl]-1-[4-(2-morpholin-4-ylethoxy)naphthalen-1-yl]urea BIRB 796 BIRB-796, 3 D3RKN_73 US11407771, Compound 43 US9187470, 43 (BIRB-796) US9260410, BIRB796 diaryl urea compound 10
Type:
Small organic molecule
Emp. Form.:
C31H37N5O3
Mol. Mass.:
527.6572
SMILES:
Cc1ccc(cc1)-n1nc(cc1NC(=O)Nc1ccc(OCCN2CCOCC2)c2ccccc12)C(C)(C)C
: