Target
Dipeptidyl peptidase 8
Ligand
BDBM50359372
Substrate
Meas. Tech.
ChEMBL_793025 (CHEMBL1932591)
IC50
>100±n/a nM
Citation
 Kato, NOka, MMurase, TYoshida, MSakairi, MYamashita, SYasuda, YYoshikawa, AHayashi, YMakino, MTakeda, MMirensha, YKakigami, T Discovery and pharmacological characterization of N-[2-({2-[(2S)-2-cyanopyrrolidin-1-yl]-2-oxoethyl}amino)-2-methylpropyl]-2-methylpyrazolo[1,5-a]pyrimidine-6-carboxamide hydrochloride (anagliptin hydrochloride salt) as a potent and selective DPP-IV inhibitor. Bioorg Med Chem 19:7221-7 (2011)  
Target
Name:
Dipeptidyl peptidase 8
Synonyms:
DPP8 DPRP-1 Dipeptidyl peptidase 8 (DPP-8) Dipeptidyl peptidase 8/9 Dipeptidyl peptidase VIII Prolyl dipeptidase DPP8
Type:
Enzyme
Mol. Mass.:
103342.62
Organism:
Homo sapiens (Human)
Description:
Q6V1X1
Residue:
898
  
Inhibitor
Name:
BDBM50359372
Synonyms:
CHEMBL1929393
Type:
Small organic molecule
Emp. Form.:
C24H35N7O2
Mol. Mass.:
453.5804
SMILES:
Cc1nc2cc(nn2c(C)c1C(=O)NCC(C)(C)NCC(=O)N1CCC[C@H]1C#N)C(C)(C)C
: