Target
Acetylcholinesterase
Ligand
BDBM50359376
Substrate
Meas. Tech.
ChEMBL_793258 (CHEMBL1931707)
IC50
483±n/a nM
Citation
 Huang, WTang, LShi, YHuang, SXu, LSheng, RWu, PLi, JZhou, NHu, Y Searching for the Multi-Target-Directed Ligands against Alzheimer's disease: discovery of quinoxaline-based hybrid compounds with AChE, H3R and BACE 1 inhibitory activities. Bioorg Med Chem 19:7158-67 (2011)  
Target
Name:
Acetylcholinesterase
Synonyms:
ACES_RAT Acetylcholinesterase and butyrylcholinesterase (AChE and BChE) Acetylcholinesterase, AChE | Ache
Type:
Enzyme
Mol. Mass.:
68193.62
Organism:
Rattus norvegicus (rat)
Description:
P37136
Residue:
614
  
Inhibitor
Name:
BDBM50359376
Synonyms:
CHEMBL1929400 | CHEMBL1929401
Type:
Small organic molecule
Emp. Form.:
C21H23N5O
Mol. Mass.:
361.4402
SMILES:
Nc1nc2ccccc2nc1NC(=O)c1ccc(CN2CCCCC2)cc1
: