Target
5-hydroxytryptamine receptor 1A
Ligand
BDBM50359434
Substrate
Meas. Tech.
ChEMBL_793382 (CHEMBL1931936)
Ki
27±n/a nM
Citation
 Marco, IValhondo, MMartín-Fontecha, MVázquez-Villa, HDel Río, JPlanas, ASagredo, ORamos, JATorrecillas, IRPardo, LFrechilla, DBenhamú, BLópez-Rodríguez, ML New serotonin 5-HT(1A) receptor agonists with neuroprotective effect against ischemic cell damage. J Med Chem 54:7986-99 (2011)  
Target
Name:
5-hydroxytryptamine receptor 1A
Synonyms:
5-HT-1A 5-HT1A 5-hydroxytryptamine receptor 1A (5HT1A) 5ht1a Htr1a Serotonin 1a (5-HT1a) receptor/Adrenergic receptor alpha-1 | Serotonin receptor 1A
Type:
G Protein-Coupled Receptor (GPCR)
Mol. Mass.:
46445.29
Organism:
Rattus norvegicus (rat)
Description:
Binding assays were performed using rat hippocampal membranes.
Residue:
422
  
Inhibitor
Name:
BDBM50359434
Synonyms:
CHEMBL1926753
Type:
Small organic molecule
Emp. Form.:
C20H25N3O3
Mol. Mass.:
355.4308
SMILES:
Oc1c2CCCn2c(=O)n1C\C=C\CNCC1CCc2ccccc2O1
: