Target
Trace amine-associated receptor 1
Ligand
BDBM50359498
Substrate
Meas. Tech.
ChEMBL_792734 (CHEMBL1930561)
EC50
5020±n/a nM
Citation
 Lewin, AHMiller, GMGilmour, B Trace amine-associated receptor 1 is a stereoselective binding site for compounds in the amphetamine class. Bioorg Med Chem 19:7044-8 (2011)  
Target
Name:
Trace amine-associated receptor 1
Synonyms:
TA1 TAAR1_HUMAN TRAR1 | trace amine-associated receptor 1
Type:
PROTEIN
Mol. Mass.:
39107.47
Organism:
Homo sapiens (Human)
Description:
ChEMBL_792734
Residue:
339
  
Inhibitor
Name:
BDBM50359498
Synonyms:
CHEMBL1927028
Type:
Small organic molecule
Emp. Form.:
C13H21NO2
Mol. Mass.:
223.3113
SMILES:
CCc1cc(OC)c(C[C@H](C)N)cc1OC
: