Target
Trace amine-associated receptor 1
Ligand
BDBM50359501
Substrate
Meas. Tech.
ChEMBL_792737 (CHEMBL1930652)
EC50
190±n/a nM
Citation
 Lewin, AHMiller, GMGilmour, B Trace amine-associated receptor 1 is a stereoselective binding site for compounds in the amphetamine class. Bioorg Med Chem 19:7044-8 (2011)  
Target
Name:
Trace amine-associated receptor 1
Synonyms:
TAAR1_RAT Taar1 Trace amine receptor 1 (TARR1) Trace amine-associated receptor 1 (TAAR1) Trar1
Type:
Enzyme
Mol. Mass.:
38034.73
Organism:
Rattus norvegicus (Rat)
Description:
Q923Y9
Residue:
332
  
Inhibitor
Name:
BDBM50359501
Synonyms:
CHEMBL1927024 | HYDROXYAMPHETAMINE
Type:
Small organic molecule
Emp. Form.:
C9H13NO
Mol. Mass.:
151.2056
SMILES:
C[C@H](N)Cc1ccc(O)cc1
: