Target
Trace amine-associated receptor 1
Ligand
BDBM86238
Substrate
Meas. Tech.
ChEMBL_792735 (CHEMBL1930650)
EC50
1350±n/a nM
Citation
 Lewin, AHMiller, GMGilmour, B Trace amine-associated receptor 1 is a stereoselective binding site for compounds in the amphetamine class. Bioorg Med Chem 19:7044-8 (2011)  
Target
Name:
Trace amine-associated receptor 1
Synonyms:
TA1 TAAR1_MACMU TRAR1 Trace amine receptor 1
Type:
PROTEIN
Mol. Mass.:
38812.87
Organism:
Macaca mulatta
Description:
ChEMBL_792735
Residue:
338
  
Inhibitor
Name:
BDBM86238
Synonyms:
CAS_3050061 NSC_3050061
Type:
Small organic molecule
Emp. Form.:
C10H13NO2
Mol. Mass.:
179.2157
SMILES:
C[C@H](N)Cc1ccc2OCOc2c1
: