Target
Trace amine-associated receptor 1
Ligand
BDBM50064708
Substrate
Meas. Tech.
ChEMBL_792735 (CHEMBL1930650)
EC50
13900±n/a nM
Citation
 Lewin, AHMiller, GMGilmour, B Trace amine-associated receptor 1 is a stereoselective binding site for compounds in the amphetamine class. Bioorg Med Chem 19:7044-8 (2011)  
Target
Name:
Trace amine-associated receptor 1
Synonyms:
TA1 TAAR1_MACMU TRAR1 Trace amine receptor 1
Type:
PROTEIN
Mol. Mass.:
38812.87
Organism:
Macaca mulatta
Description:
ChEMBL_792735
Residue:
338
  
Inhibitor
Name:
BDBM50064708
Synonyms:
(R)-1-(4-bromo-2,5-dimethoxyphenyl)propan-2-amine CHEMBL69700
Type:
Small organic molecule
Emp. Form.:
C11H16BrNO2
Mol. Mass.:
274.154
SMILES:
COc1cc(C[C@@H](C)N)c(OC)cc1Br
: