Target
Thymidylate kinase
Ligand
BDBM50118628
Substrate
Meas. Tech.
ChEMBL_793311 (CHEMBL1931814)
Ki
10000±n/a nM
Citation
 Van Poecke, SMunier-Lehmann, HHelynck, OFroeyen, MVan Calenbergh, S Synthesis and inhibitory activity of thymidine analogues targeting Mycobacterium tuberculosis thymidine monophosphate kinase. Bioorg Med Chem 19:7603-11 (2011)  
Target
Name:
Thymidylate kinase
Synonyms:
KTHY_MYCTU Thymidine monophosphate kinase tmk
Type:
PROTEIN
Mol. Mass.:
22636.29
Organism:
Mycobacterium tuberculosis
Description:
ChEMBL_208218
Residue:
214
  
Inhibitor
Name:
BDBM50118628
Synonyms:
(R)-1-((R)-4-Azido-5-methylphosphate-tetrahydro-furan-2-yl)-5-methyl-1H-pyrimidine-2,4-dione | Phosphoric acid mono-[3-azido-5-(5-methyl-2,4-dioxo-3,4-dihydro-2H-pyrimidin-1-yl)-tetrahydro-furan-2-ylmethyl] ester
Type:
Small organic molecule
Emp. Form.:
C10H12N5O7P
Mol. Mass.:
345.2064
SMILES:
Cc1cn([C@H]2C[C@H](N=[N+]=[N-])[C@@H](COP([O-])([O-])=O)O2)c(=O)[nH]c1=O
: