Target
Casein kinase II subunit alpha
Ligand
BDBM50359846
Substrate
Meas. Tech.
ChEMBL_792097 (CHEMBL1930359)
Ki
83±n/a nM
Citation
 Janeczko, MOrzeszko, AKazimierczuk, ZSzyszka, RBaier, A CK2a and CK2a' subunits differ in their sensitivity to 4,5,6,7-tetrabromo- and 4,5,6,7-tetraiodo-1H-benzimidazole derivatives. Eur J Med Chem 47:345-50 (2012)  
Target
Name:
Casein kinase II subunit alpha
Synonyms:
CK II CK2- alpha CSK21_HUMAN Casein kinase 2 Casein kinase II alpha/beta Casein kinase II subunit alpha (CK2A1) Casein kinase II subunit alpha (CK2a V66A) Casein kinase II subunit alpha (CK2a)
Type:
Enzyme
Mol. Mass.:
45151.12
Organism:
Homo sapiens (Human)
Description:
P68400
Residue:
391
  
Inhibitor
Name:
BDBM50359846
Synonyms:
CHEMBL1233807
Type:
Small organic molecule
Emp. Form.:
C11H9Br4N3O2
Mol. Mass.:
534.824
SMILES:
CN(C)c1nc2c(Br)c(Br)c(Br)c(Br)c2n1CC(O)=O
: