Target
5-hydroxytryptamine receptor 2C
Ligand
BDBM50359968
Substrate
Meas. Tech.
ChEMBL_791366 (CHEMBL1930137)
Ki
597±n/a nM
Citation
 Fiorino, FSeverino, BMagli, EPerissutti, EFrecentese, FEsposito, AIncisivo, GMCiano, AMassarelli, PNencini, CSantagada, VCaliendo, G New potent 5-HT(2A) receptor ligands containing an N'-cyanopicolinamidine nucleus: Synthesis and in vitro pharmacological evaluation. Eur J Med Chem 47:520-9 (2012)  
Target
Name:
5-hydroxytryptamine receptor 2C
Synonyms:
5-HT2C 5-hydroxytryptamine receptor 2C (5HT2c) 5ht1c Htr2c Serotonin receptor 2a and 2c (5HT2A and 5HT2C)
Type:
Enzyme
Mol. Mass.:
51935.10
Organism:
Rattus norvegicus (Rat)
Description:
P08909
Residue:
460
  
Inhibitor
Name:
BDBM50359968
Synonyms:
CHEMBL1927087
Type:
Small organic molecule
Emp. Form.:
C18H28N6O
Mol. Mass.:
344.4545
SMILES:
CCOCCN1CCN(CCCN=C(NC#N)c2ccccn2)CC1
: