Target
Prostaglandin E2 receptor EP4 subtype
Ligand
BDBM50360159
Substrate
Meas. Tech.
ChEMBL_793560 (CHEMBL1932311)
Ki
10±n/a nM
Citation
 Kambe, TMaruyama, TNagase, TOgawa, SMinamoto, CSakata, KMaruyama, TNakai, HToda, M Synthesis and evaluation of novel modified¿-lactam prostanoids as EP4 subtype-selective agonists. Bioorg Med Chem 20:702-13 (2012)  
Target
Name:
Prostaglandin E2 receptor EP4 subtype
Synonyms:
PE2R4_MOUSE Prostanoid EP4 receptor Ptgerep4
Type:
G-protein coupled receptor
Mol. Mass.:
56175.66
Organism:
Mus musculus (Mouse)
Description:
Residue:
513
  
Inhibitor
Name:
BDBM50360159
Synonyms:
CHEMBL1929526
Type:
Small organic molecule
Emp. Form.:
C23H33NO5
Mol. Mass.:
403.5118
SMILES:
COCc1cccc(C[C@H](O)\C=C\[C@H]2CCC(=O)N2CCCCCCC(O)=O)c1
: