Target
Adenosine receptor A2b
Ligand
BDBM50360184
Substrate
Meas. Tech.
ChEMBL_794134 (CHEMBL1931872)
IC50
10700±n/a nM
Citation
 Federico, SPaoletta, SCheong, SLPastorin, GCacciari, BStragliotto, SKlotz, KNSiegel, JGao, ZGJacobson, KAMoro, SSpalluto, G Synthesis and Biological Evaluation of a New Series of 1,2,4-Triazolo[1,5-a]-1,3,5-triazines as Human A(2A) Adenosine Receptor Antagonists with Improved Water Solubility. J Med Chem 54:877-89 (2011)  
Target
Name:
Adenosine receptor A2b
Synonyms:
AA2BR_HUMAN ADORA2B Adenosine receptors A2b | Adenosine receptors; A2a & A2b
Type:
G Protein-Coupled Receptor (GPCR)
Mol. Mass.:
36341.22
Organism:
Homo sapiens (Human)
Description:
Residue:
332
  
Inhibitor
Name:
BDBM50360184
Synonyms:
CHEMBL1927444
Type:
Small organic molecule
Emp. Form.:
C16H23N8O
Mol. Mass.:
343.4063
SMILES:
Nc1nc(NCC2CCC(C[NH3+])CC2)nc2nc(nn12)-c1ccco1
: