Target
Lysosomal acid glucosylceramidase
Ligand
BDBM50360268
Substrate
Meas. Tech.
ChEMBL_796390 (CHEMBL1937705)
IC50
244000±n/a nM
Citation
 Deschamp, JMondon, MNakagawa, SKato, AAlonzi, DSButters, TDZhang, YSollogoub, MBlériot, Y Towards a stable noeuromycin analog with a D-manno configuration: synthesis and glycosidase inhibition of D-manno-like tri- and tetrahydroxylated azepanes. Bioorg Med Chem 20:641-9 (2012)  
Target
Name:
Lysosomal acid glucosylceramidase
Synonyms:
Acid beta-glucosidase GBA GBA1_BOVIN | Glucosylceramidase
Type:
PROTEIN
Mol. Mass.:
59862.93
Organism:
Bos taurus
Description:
ChEMBL_1460504
Residue:
536
  
Inhibitor
Name:
BDBM50360268
Synonyms:
CHEMBL1933098
Type:
Small organic molecule
Emp. Form.:
C7H15NO3
Mol. Mass.:
161.1989
SMILES:
C[C@@H]1CNC[C@@H](O)[C@@H](O)[C@@H]1O
: