Target
Sterol O-acyltransferase 1
Ligand
BDBM50360306
Substrate
Meas. Tech.
ChEMBL_795885 (CHEMBL1936449)
IC50
40±n/a nM
Citation
 Doi, TMuraoka, TOhshiro, TMatsuda, DYoshida, MTakahashi, TOmura, STomoda, H Conformationally restricted analog and biotin-labeled probe based on beauveriolide III. Bioorg Med Chem Lett 22:696-9 (2011)  
Target
Name:
Sterol O-acyltransferase 1
Synonyms:
ACACT ACAT Acetyl-CoA acetyltransferase, mitochondrial Acyl-CoA: cholesterol acyltransferase (ACAT) Cholesterol acyltransferase 1 SOAT1 STAT
Type:
Multi-pass membrane protein may form homo- or heterodimers.
Mol. Mass.:
64751.94
Organism:
Homo sapiens (Human)
Description:
P35610
Residue:
550
  
Inhibitor
Name:
BDBM50360306
Synonyms:
CHEMBL505016
Type:
Small organic molecule
Emp. Form.:
C33H45N3O5
Mol. Mass.:
563.7275
SMILES:
CCCC[C@H](C)[C@@H]1CC(=O)N[C@@H](C(c2ccccc2)c2ccccc2)C(=O)N[C@@H](C)C(=O)N[C@H]([C@@H](C)CC)C(=O)O1
: