Target
B1 bradykinin receptor
Ligand
BDBM50360416
Substrate
Meas. Tech.
ChEMBL_796433 (CHEMBL1937748)
Ki
4±n/a nM
Citation
 Bryan, MCBiswas, KPeterkin, TARzasa, RMArik, LLehto, SGSun, HHsieh, FYXu, CFremeau, RTAllen, JR Chromenones as potent bradykinin B1 antagonists. Bioorg Med Chem Lett 22:619-22 (2011)  
Target
Name:
B1 bradykinin receptor
Synonyms:
B1 BRADYKININ B1R BK-1 receptor BRADYB1 | Bradykinin B1 receptor
Type:
Enzyme
Mol. Mass.:
40508.87
Organism:
Homo sapiens (Human)
Description:
P46663
Residue:
353
  
Inhibitor
Name:
BDBM50360416
Synonyms:
CHEMBL1934260
Type:
Small organic molecule
Emp. Form.:
C32H31ClN2O3
Mol. Mass.:
527.053
SMILES:
Clc1cccc2occ(-c3ccc(cc3)C(=O)N[C@H]3CCCc4cc(CN5CCCCC5)ccc34)c(=O)c12
: