Target
Neuraminidase
Ligand
BDBM50360452
Substrate
Meas. Tech.
ChEMBL_795431 (CHEMBL1937380)
EC50
742960±n/a nM
Citation
 Suzuki, KKoyama, TYingsakmongkon, SSuzuki, YHatano, KMatsuoka, K Synthesis and biological evaluation of sialic acid derivatives containing a long hydrophobic chain at the anomeric position and their C-5 linked polymers as potent influenza virus inhibitors. Bioorg Med Chem 20:446-54 (2011)  
Target
Name:
Neuraminidase
Synonyms:
Influenza A Virus Neuraminidase NRAM_I34A1 Neuraminidase A
Type:
Enzyme
Mol. Mass.:
50124.14
Organism:
Influenza A virus (A/Puerto Rico/8/34/Mount Sinai(H1N1))
Description:
P03468
Residue:
454
  
Inhibitor
Name:
BDBM50360452
Synonyms:
CHEMBL1934620
Type:
Small organic molecule
Emp. Form.:
C30H54N2O9S
Mol. Mass.:
618.823
SMILES:
CCCCCCCCCCCCS[C@@]1(C[C@H](O)[C@@H](NC(=O)CCCCCNC(=O)C=C)[C@@H](O1)[C@H](O)[C@H](O)CO)C(O)=O
: