Target
Adenosine 5'-monophosphoramidase HINT1
Ligand
BDBM50360479
Substrate
Meas. Tech.
ChEMBL_795618 (CHEMBL1936048)
Ki
715000±n/a nM
Citation
 Bardaweel, SKGhosh, BWagner, CR Synthesis and evaluation of potential inhibitors of human and Escherichia coli histidine triad nucleotide binding proteins. Bioorg Med Chem Lett 22:558-60 (2011)  
Target
Name:
Adenosine 5'-monophosphoramidase HINT1
Synonyms:
Adenosine 5'-monophosphoramidase HINT1 Histidine triad nucleotide-binding protein 1 PKCI1 Protein kinase C inhibitor 1 | Protein kinase C-interacting protein 1
Type:
PROTEIN
Mol. Mass.:
13803.77
Organism:
Homo sapiens (Human)
Description:
ChEMBL_795618
Residue:
126
  
Inhibitor
Name:
BDBM50360479
Synonyms:
CHEMBL1934755
Type:
Small organic molecule
Emp. Form.:
C21H23N7O5
Mol. Mass.:
453.4512
SMILES:
Cc1cn([C@H]2C[C@H](N=[N+]=[N-])[C@@H](COC(=O)NCCc3c[nH]c4ccccc34)O2)c(=O)[nH]c1=O
: