Target
Broad substrate specificity ATP-binding cassette transporter ABCG2
Ligand
BDBM50360500
Substrate
Meas. Tech.
ChEMBL_795925 (CHEMBL1936798)
IC50
2720±n/a nM
Citation
 Juvale, KPape, VFWiese, M Investigation of chalcones and benzochalcones as inhibitors of breast cancer resistance protein. Bioorg Med Chem 20:346-55 (2011)  
Target
Name:
Broad substrate specificity ATP-binding cassette transporter ABCG2
Synonyms:
ABCG2 ABCP ATP-binding cassette sub-family G member 2 ATP-binding cassette, sub-family G, member 2 BCRP1 CDw338 Mitoxantrone resistance-associated protein Urate exporter
Type:
Multi-pass membrane protein; monomer or homodimer; disulfide-linked
Mol. Mass.:
72329.48
Organism:
Homo sapiens (Human)
Description:
Q9UNQ0
Residue:
655
  
Inhibitor
Name:
BDBM50360500
Synonyms:
CHEMBL1935208
Type:
Small organic molecule
Emp. Form.:
C17H15ClO3
Mol. Mass.:
302.752
SMILES:
COc1ccc(cc1OC)C(=O)\C=C\c1ccc(Cl)cc1
: