Target
Peroxisome proliferator-activated receptor delta
Ligand
BDBM50360740
Substrate
Meas. Tech.
ChEMBL_796455 (CHEMBL1937770)
EC50
6600±n/a nM
Citation
 Nomura, MYumoto, KShinozaki, TIsogai, STakano, YMurakami, K Discovery of cyclic amine-substituted benzoic acids as PPARa agonists. Bioorg Med Chem Lett 22:334-8 (2011)  
Target
Name:
Peroxisome proliferator-activated receptor delta
Synonyms:
NUC1 Nuclear hormone receptor 1 PPAR-beta PPARD_MOUSE Ppard
Type:
PROTEIN
Mol. Mass.:
49719.14
Organism:
Mus musculus
Description:
ChEMBL_1288931
Residue:
440
  
Inhibitor
Name:
BDBM50360740
Synonyms:
CHEMBL1934476
Type:
Small organic molecule
Emp. Form.:
C23H22ClN3O3S
Mol. Mass.:
455.957
SMILES:
Cc1nc(sc1C(=O)N[C@H]1CCCN(C1)c1cccc(c1)C(O)=O)-c1ccc(Cl)cc1
: