Target
Histamine H4 receptor
Ligand
BDBM50361010
Substrate
Meas. Tech.
ChEMBL_795794 (CHEMBL1936681)
IC50
46±n/a nM
Citation
 Smits, RALim, HDvan der Meer, TKuhne, SBessembinder, KZuiderveld, OPWijtmans, Mde Esch, IJLeurs, R Ligand based design of novel histamine H4 receptor antagonists; fragment optimization and analysis of binding kinetics. Bioorg Med Chem Lett 22:461-7 (2011)  
Target
Name:
Histamine H4 receptor
Synonyms:
AXOR35 GPCR105 HH4R HRH4 Histamine H4 receptor Histamine receptor (H3 and H4) SP9144
Type:
G Protein-Coupled Receptor (GPCR)
Mol. Mass.:
44517.02
Organism:
Homo sapiens (Human)
Description:
Binding assays were using CHO cells stably expressing hH4R receptors.
Residue:
390
  
Inhibitor
Name:
BDBM50361010
Synonyms:
CHEMBL1935572
Type:
Small organic molecule
Emp. Form.:
C17H19N5S
Mol. Mass.:
325.431
SMILES:
CN1CCN(CC1)c1nc(N)nc2cc(ccc12)-c1ccsc1
: