Target
Hypoxanthine-guanine phosphoribosyltransferase
Ligand
BDBM50361443
Substrate
Meas. Tech.
ChEMBL_794579 (CHEMBL1936998)
Ki
5000±n/a nM
Citation
 Kremerovñ, MDracínský, MHocková, DHolý, AKeough, DTGuddat, LW Synthesis of purine N9-[2-hydroxy-3-O-(phosphonomethoxy)propyl] derivatives and their side-chain modified analogs as potential antimalarial agents. Bioorg Med Chem 20:1222-30 (2012)  
Target
Name:
Hypoxanthine-guanine phosphoribosyltransferase
Synonyms:
HGPRT HPRT HPRT_HUMAN Hypoxanthine-guanine phosphoribosyltransferase (HGPRT)
Type:
Protein
Mol. Mass.:
24579.61
Organism:
Homo sapiens (Human)
Description:
P00492
Residue:
218
  
Inhibitor
Name:
BDBM50361443
Synonyms:
CHEMBL1934409
Type:
Small organic molecule
Emp. Form.:
C11H16N5O8P
Mol. Mass.:
377.2472
SMILES:
Nc1nc2n(CC(COCP(O)(O)=O)OCC(O)=O)cnc2c(=O)[nH]1
: