Target
Lysine-specific demethylase 4A
Ligand
BDBM50344962
Substrate
Meas. Tech.
ChEMBL_797220 (CHEMBL1942535)
IC50
26000±n/a nM
Citation
 Suzuki, TMiyata, N Lysine demethylases inhibitors. J Med Chem 54:8236-50 (2011)  
Target
Name:
Lysine-specific demethylase 4A
Synonyms:
JHDM3A JMJD2A Jumonji domain-containing protein 2A KDM4A_HUMAN Lysine-specific demethylase 4A | Lysine-specific demethylase 4A (KDM4A)
Type:
Enzyme
Mol. Mass.:
120647.83
Organism:
Homo sapiens (Human)
Description:
O75164
Residue:
1064
  
Inhibitor
Name:
BDBM50344962
Synonyms:
(2S)-2-HYDROXYPENTANEDIOIC ACID L-2-Hydroxyglutarate
Type:
Small organic molecule
Emp. Form.:
C5H8O5
Mol. Mass.:
148.114
SMILES:
O[C@@H](CCC(O)=O)C(O)=O
: