Target
Lysine-specific demethylase 2A
Ligand
BDBM50344962
Substrate
Meas. Tech.
ChEMBL_797221 (CHEMBL1942536)
IC50
48000±n/a nM
Citation
 Suzuki, TMiyata, N Lysine demethylases inhibitors. J Med Chem 54:8236-50 (2011)  
Target
Name:
Lysine-specific demethylase 2A
Synonyms:
AA1-1162 F-box and leucine-rich repeat protein 11 FBL7 Homo sapiens lysine demethylase 2A (KDM2A) KDM2A KIAA1004 Lysine-specific demethylase 2A (KDM2A) | NM_012308
Type:
Enzyme Catalytic Domain
Mol. Mass.:
132809.04
Organism:
Homo sapiens (Human)
Description:
Residue:
1162
  
Inhibitor
Name:
BDBM50344962
Synonyms:
(2S)-2-HYDROXYPENTANEDIOIC ACID L-2-Hydroxyglutarate
Type:
Small organic molecule
Emp. Form.:
C5H8O5
Mol. Mass.:
148.114
SMILES:
O[C@@H](CCC(O)=O)C(O)=O
: